9-Phenyl-1,7-dicarbadodecaborane

Gas phase ion energetics data

Data compiled by: Sharon G. Lias and Joel F. Liebman

Ionization energy determinations

IE (eV) Method Reference
8.5 ± 0.2PIOrlov, Pustobaev, et al., 1988

References

Orlov, Pustobaev, et al., 1988
Orlov, V.M.; Pustobaev, V.N.; Ol'shevskaya, V.A.; Zakharkin, L.I.; Gal'chenko, G.L., Study of the distribution of electron density in vinyl and aryl derivatives of closo-12-carboranes by photoionization mass specctrometry, Dokl. Phys. Chem., 1988, 300, 518. [all data]