Hexane, 1,6-diisocyanato-

Phase change data

Data compiled as indicated in comments:
TRC - Thermodynamics Research Center, NIST Boulder Laboratories, Chris Muzny director
DH - Eugene S. Domalski and Elizabeth D. Hearing
AC - William E. Acree, Jr., James S. Chickos

Quantity Value Units Method Reference Comment
Ttriple206.060KN/ALebedev, Bykova, et al., 1985Uncertainty assigned by TRC = 0.01 K; TRC

Enthalpy of fusion

ΔfusH (kcal/mol) Temperature (K) Reference Comment
4.4551206.064Lebedev, Bykova, et al., 1985, 2DH
4.4551206.06Bykova and Lebedev, 1983DH
4.455206.1Domalski and Hearing, 1996AC

Entropy of fusion

ΔfusS (cal/mol*K) Temperature (K) Reference Comment
21.62206.064Lebedev, Bykova, et al., 1985, 2DH
21.62206.06Bykova and Lebedev, 1983DH

In addition to the Thermodynamics Research Center (TRC) data available from this site, much more physical and chemical property data is available from the following TRC products:

References

Lebedev, Bykova, et al., 1985
Lebedev, B.V.; Bykova, T.A.; Kiparisova, Ye.G.; Pankratov, V.A.; Frenkel, Ts.M.; Korshak, V.V., A calorimetric study of 1,6-hexamethylene diisocyanate,, Vysokomol. Soedin., Ser. A, 1985, 27, 1411-6. [all data]

Lebedev, Bykova, et al., 1985, 2
Lebedev, B.V.; Bykova, T.A.; Kiparisova, Y.G.; Pankratov, V.A.; Frenkel, Ts.M.; Korshak, V.V., A calorimetric study of 1,6-hexamethylene diisocyanate, its polycyclotrimerization and the resulting polycyclotrimer in the 13.8-370 K region, Vysokomol. Soedin., 1985, A27, 1411-1416. [all data]

Bykova and Lebedev, 1983
Bykova, T.A.; Lebedev, B.V., Thermodynamics of 1,6-hexamethylene diisocyanate at 0-330 K, Fiz.-khim. Osnovy Sinteza i Pererab. Polimerov, 1983, 39-41. [all data]

Domalski and Hearing, 1996
Domalski, Eugene S.; Hearing, Elizabeth D., Heat Capacities and Entropies of Organic Compounds in the Condensed Phase. Volume III, J. Phys. Chem. Ref. Data, 1996, 25, 1, 1, https://doi.org/10.1063/1.555985 . [all data]