4-Undecene, (Z)-

Kovats' RI, non-polar column, isothermal

Data compiled by: NIST Mass Spectrometry Data Center, William E. Wallace, director

Column type CapillaryCapillaryCapillaryCapillaryCapillary
Active phase SqualaneOV-101SqualaneSqualaneSqualane
Column length (m)  50.
Carrier gas  He
Substrate
Column diameter (mm)  0.25
Phase thickness (μm)
Temperature (C) 100.110.100.115.130.
I 1080.1092.1080.1081.1082.
ReferenceHeinzen, Soares, et al., 1999Rang, Kuningas, et al., 1987Sojak, Hrivnak, et al., 1973Sojak, Hrivnak, et al., 1973Sojak, Hrivnak, et al., 1973
Comment MSDC-RI MSDC-RI MSDC-RI MSDC-RI MSDC-RI
Column type CapillaryCapillary
Active phase SqualaneApiezon L
Column length (m)  45.
Carrier gas
Substrate
Column diameter (mm)  0.25
Phase thickness (μm)
Temperature (C) 86.120.
I 1080.1086.9
ReferenceSojak, Hrivnak, et al., 1973Eisen, Orav, et al., 1972
Comment MSDC-RI MSDC-RI

References

Heinzen, Soares, et al., 1999
Heinzen, V.E.F.; Soares, M.F.; Yunes, R.A., Semi-empirical topological method for the prediction of the chromatographic retention of cis- and trans-alkene isomers and alkanes, J. Chromatogr. A, 1999, 849, 2, 495-506, https://doi.org/10.1016/S0021-9673(99)00530-0 . [all data]

Rang, Kuningas, et al., 1987
Rang, S.; Kuningas, K.; Strenze, T.; Orav, A.; Eisen, O., Retention and Thermodynamics of Solution of n-Alkenes in OV-101, J. Chromatogr., 1987, 406, 75-80, https://doi.org/10.1016/S0021-9673(00)94018-4 . [all data]

Sojak, Hrivnak, et al., 1973
Sojak, L.; Hrivnak, J.; Majer, P.; Janak, J., Capillary Gas Chromatography of Linear Alkenes on Squalane, Anal. Chem., 1973, 45, 2, 293-302, https://doi.org/10.1021/ac60324a039 . [all data]

Eisen, Orav, et al., 1972
Eisen, O.; Orav, A.; Rang, S., Identifizierung von Normal-Alkenen, Cyclopentenen und -Hexenen mittels Kapillar-Gas-Chromatographie. Identification des alcènes, cyclopentènes et -hexènes à l'aide de la chromatogrpahie en phase gazeuse sur colonne capillaire, Chromatographia, 1972, 5, 11, 229-239, https://doi.org/10.1007/BF02270600 . [all data]