1,7-Dichloroheptane

Phase change data

Data compiled as indicated in comments:
BS - Robert L. Brown and Stephen E. Stein
AC - William E. Acree, Jr., James S. Chickos

Quantity Value Units Method Reference Comment
Δvap61.2kJ/molN/AVarushchenko, Loseva, et al., 1988Based on data from 410. - 490. K. See also Basarová and Svoboda, 1991.; AC

Reduced pressure boiling point

Tboil (K) Pressure (bar) Reference Comment
397.70.047Weast and Grasselli, 1989BS

Enthalpy of vaporization

ΔvapH (kJ/mol) Temperature (K) Reference Comment
52.3421.Dykyj, Svoboda, et al., 1999Based on data from 406. - 491. K.; AC

References

Varushchenko, Loseva, et al., 1988
Varushchenko, R.M.; Loseva, O.L.; Druzhinina, A.I.; Zorina, E.F., Zh. Fiz. Khim., 1988, 62, 1776. [all data]

Basarová and Svoboda, 1991
Basarová, Pavlína; Svoboda, Václav, Calculation of heats of vaporization of halogenated hydrocarbons from saturated vapour pressure data, Fluid Phase Equilibria, 1991, 68, 13-34, https://doi.org/10.1016/0378-3812(91)85008-I . [all data]

Weast and Grasselli, 1989
CRC Handbook of Data on Organic Compounds, 2nd Editon, Weast,R.C and Grasselli, J.G., ed(s)., CRC Press, Inc., Boca Raton, FL, 1989, 1. [all data]

Dykyj, Svoboda, et al., 1999
Dykyj, J.; Svoboda, J.; Wilhoit, R.C.; Frenkel, M.L.; Hall, K.R., Vapor Pressure of Chemicals: Part A. Vapor Pressure and Antoine Constants for Hydrocarbons and Sulfur, Selenium, Tellurium and Hydrogen Containing Organic Compounds, Springer, Berlin, 1999, 373. [all data]