Diazene, dipropyl

Gas phase thermochemistry data

Data compiled as indicated in comments:
DRB - Donald R. Burgess, Jr.
ALS - Hussein Y. Afeefy, Joel F. Liebman, and Stephen E. Stein

Quantity Value Units Method Reference Comment
Δfgas62.4kJ/molN/ALebedeva, Masalitinova, et al., 1980Value computed using ΔfHliquid° value of 22.0 kj/mol from Lebedeva, Masalitinova, et al., 1980 and ΔvapH° value of 40.4 kj/mol from Engel, Wood, et al., 1974.; DRB
Δfgas51.9kJ/molCcbEngel, Wood, et al., 1974see Engel, Melaugh, et al., 1976; ALS

Condensed phase thermochemistry data

Data compiled by: Hussein Y. Afeefy, Joel F. Liebman, and Stephen E. Stein

Quantity Value Units Method Reference Comment
Δfliquid22.kJ/molCcbLebedeva, Masalitinova, et al., 1980
Δfliquid11.5kJ/molCcbEngel, Wood, et al., 1974see Engel, Melaugh, et al., 1976
Quantity Value Units Method Reference Comment
Δcliquid-4384. ± 1.kJ/molCcbLebedeva, Masalitinova, et al., 1980
Δcliquid-4373.33 ± 0.88kJ/molCcbEngel, Wood, et al., 1974see Engel, Melaugh, et al., 1976

References

Lebedeva, Masalitinova, et al., 1980
Lebedeva, N.D.; Masalitinova, T.N.; Mon'yakova, O.N.; Oleinikova, T.P., Energy of hydrazone = azo compound tautomeric transformation, J. Org. Chem. USSR (Engl. Transl.), 1980, 16, 226-228. [all data]

Engel, Wood, et al., 1974
Engel, P.S.; Wood, J.L.; Sweet, J.A.; Margrave, J.L., Thermochemistry of azoalkanes, J. Am. Chem. Soc., 1974, 96, 2381-2387. [all data]

Engel, Melaugh, et al., 1976
Engel, P.S.; Melaugh, R.A.; Mansson, M.; Timberlake, J.W.; Garner, A.W.; Rossini, F.D., Thermochemistry of nine diazenes (azo compounds), J. Chem. Thermodyn., 1976, 8, 607-621. [all data]