Heptanoic acid, 7-chloro-
- Formula: C7H13ClO2
- Molecular weight: 164.630
- IUPAC Standard InChIKey: IGNBKLCFKTYIRI-UHFFFAOYSA-N
- CAS Registry Number: 821-57-8
- Chemical structure:

Kovats' RI, non-polar column, isothermal

Column type | Active phase | Temperature (C) | I | Reference | Comment |
---|---|---|---|---|---|
Packed | E-301 | 170. | 1374. | Shashkova, Znamenskaia, et al., 1969 | He, Celite 545 (0.20-0.50 mm); Column length: 2. m |

References

Shashkova, Znamenskaia, et al., 1969
Shashkova, A.A.; Znamenskaia, A.P.; Pas'ko, L.Ya.,
Investigation of esters of odd series halohenated acids with Kovats indices,
Gazovaya Khromatografiya, 1969, 9, 40-47. [all data]