Thiocyanate, fluorine

Gas phase ion energetics data

Data compiled by: Sharon G. Lias, John E. Bartmess, Joel F. Liebman, John L. Holmes, Rhoda D. Levin, and W. Gary Mallard

Ionization energy determinations

IE (eV) Method Reference Comment
10.76PEJonkers, Grabandt, et al., 1982
10.93 ± 0.02PEJonkers, Grabandt, et al., 1982Vertical value

References

Jonkers, Grabandt, et al., 1982
Jonkers, G.; Grabandt, O.; Mooyman, R.; De Lange, C.A., He(I) photoelectron spectroscopy of transient species: Fluorothiocyanate (FSCN), J. Electron Spectrosc. Relat. Phenom., 1982, 26, 147. [all data]