1-Chloro-2,4-diisopropylbenzene

Reaction thermochemistry data

Data compiled by: Hussein Y. Afeefy, Joel F. Liebman, and Stephen E. Stein

Individual Reactions

Benzene, chloro- + 1-Chloro-2,4-diisopropylbenzene = Benzene, 1-chloro-2-(1-methylethyl)- + Benzene, 1-chloro-4-(1-methylethyl)-

By formula: C6H5Cl + C12H17Cl = C9H11Cl + C9H11Cl

Quantity Value Units Method Reference Comment
Δr-0.20 ± 0.10kcal/molEqkNesterova, Rozhnov, et al., 1985liquid phase

References

Nesterova, Rozhnov, et al., 1985
Nesterova, T.N.; Rozhnov, A.M.; Malova, T.N.; Kovzel, E.N., Molar enthalpies of formation of isopropylchlorobenzenes derived from equilibrium measurements, J. Chem. Thermodyn., 1985, 17, 649-656. [all data]