Tetradecanedioic acid

Phase change data

Data compiled by: William E. Acree, Jr., James S. Chickos

Quantity Value Units Method Reference Comment
Δvap127.4 ± 2.3kJ/molCGCRoux, Temprado, et al., 2005Based on data from 424. - 503. K.

Enthalpy of fusion

ΔfusH (kJ/mol) Temperature (K) Method Reference
56.5397.3DSCRoux, Temprado, et al., 2005

References

Roux, Temprado, et al., 2005
Roux, Maria Victoria; Temprado, Manuel; Chickos, James S., Vaporization, fusion and sublimation enthalpies of the dicarboxylic acids from C4 to C14 and C16, The Journal of Chemical Thermodynamics, 2005, 37, 9, 941-953, https://doi.org/10.1016/j.jct.2004.12.011 . [all data]