Benzoic acid, 2,2'-[oxybis(4,1-phenyleneiminocarbonyl)]bis-

Reaction thermochemistry data

Data compiled by: Hussein Y. Afeefy, Joel F. Liebman, and Stephen E. Stein

Individual Reactions

C20H16N2O4 + Phthalic anhydride = C28H20N2O7

By formula: C20H16N2O4 + C8H4O3 = C28H20N2O7

Quantity Value Units Method Reference Comment
Δr-15.0 ± 0.1kcal/molEqkKaryakin, Rabinovich, et al., 1978liquid phase; solvent: DMF

References

Karyakin, Rabinovich, et al., 1978
Karyakin, N.V.; Rabinovich, I.B.; Pal'tseva, N.G., Thermodynamics of the reactions of aromatic diamines with dianhydrides of tetracarboxylic acids, Polym. Sci. USSR, 1978, 20, 2274-2279. [all data]