Dimethylvinylethynylmethanol butyl ether

Phase change data

Data compiled as indicated in comments:
ALS - Hussein Y. Afeefy, Joel F. Liebman, and Stephen E. Stein
DRB - Donald R. Burgess, Jr.

Quantity Value Units Method Reference Comment
Δvap13.3 ± 0.02kcal/molVVan-Chin-Syan, Dolbneva, et al., 1982ALS
Δvap13.3kcal/molN/AVan-Chin-Syan, Dolbneva, et al., 1982DRB

References

Van-Chin-Syan, Dolbneva, et al., 1982
Van-Chin-Syan, Yu.Ya.; Dolbneva, T.N.; Vasil'ev, V.P.; Chuchmarev, S.K.; Puchin, V.A., Thermodynamic Properties of Dimethyl-vinylethynylmethanol and its derivatives, Russ. J. Phys. Chem. (Engl. Transl.), 1982, 56, 1736-1767. [all data]