1,5-Anhydro-2,3,4,6-tetra-O-methyl-D-glucitol

Van Den Dool and Kratz RI, non-polar column, temperature ramp

View large format table.

Column type Active phase I Reference Comment
CapillaryDB-51363.28Elvebak and Gray, 199530. m/0.25 mm/0.25 μm, He, 2. K/min; Tstart: 80. C; Tend: 250. C

References

Elvebak and Gray, 1995
Elvebak, L.E., II; Gray, G.R., Authentic standards for the reductive-cleavage method. The positional isomers of partially methylated and acetylated or benzoylated 1,5-anhydro-D-glucitol, Carbohyd. Res., 1995, 274, 85-97, https://doi.org/10.1016/0008-6215(95)00094-A . [all data]