(1S,4R,5R)-1,3,3-Trimethyl-2-oxabicyclo[2.2.2]octan-5-ol

Van Den Dool and Kratz RI, non-polar column, custom temperature program

View large format table.

Column type Active phase I Reference Comment
CapillaryHP-5MS1240.7Andriamaharavo, 201430. m/0.25 mm/0.25 μm, He; Program: 60C (1 min) => 5 C/min => 210C => 10 C/min => 280C (15 min)

Normal alkane RI, non-polar column, temperature ramp

View large format table.

Column type Active phase I Reference Comment
CapillaryHP-5MS1259.Southwell, Russell, et al., 200330. m/0.25 mm/0.25 μm, He, 50. C @ 1. min, 6. K/min; Tend: 240. C

Normal alkane RI, polar column, temperature ramp

View large format table.

Column type Active phase I Reference Comment
CapillaryDB-Wax Etr2160.Southwell, Russell, et al., 200360. m/0.25 mm/0.25 μm, H2, 50. C @ 1. min, 6. K/min; Tend: 240. C

References

Andriamaharavo, 2014
Andriamaharavo, N.R., Retention Data. NIST Mass Spectrometry Data Center., NIST Mass Spectrometry Data Center, 2014. [all data]

Southwell, Russell, et al., 2003
Southwell, I.A.; Russell, M.F.; Maddox, C.D.A.; Wheeler, G.S., Differential metabolism of 1,8-cineole in insects, J. Chem. Ecol., 2003, 29, 1, 83-94, https://doi.org/10.1023/A:1021976513603 . [all data]