H2CNC-

Vibrational and/or electronic energy levels

Data compiled by: Marilyn E. Jacox

State:   ?

 Energy
 (cm-1
 Med.   Transition   λmin
 (nm)
 λmax
 (nm)

References

Td = 8540 ± 190 gas Moran, Ellis, et al., 1987

State:   X

Vib.
sym.
 No.   Approximate
 type of mode
 cm-1   Med.   Method   References

a' 5 H2CN deform. 374 gas PE Moran, Ellis, et al., 1987

Additional references: Jacox, 1994, page 252

Moran, Ellis, et al., 1987
Moran, S.; Ellis, H.B., Jr.; DeFrees, D.J.; McLean, A.D.; Paulson, S.E.; Ellison, G.B., Carbanion spectroscopy: CH2NC-, J. Am. Chem. Soc., 1987, 109, 6004. [all data]

Jacox, 1994
Jacox, M.E., Vibrational and electronic energy levels of polyatomic transient molecules, American Chemical Society, Washington, DC, 1994, 464. [all data]