3-Pentenoic acid, 1,1-dimethylethyl ester, (E)-

Reaction thermochemistry data

Data compiled by: Hussein Y. Afeefy, Joel F. Liebman, and Stephen E. Stein

Individual Reactions

Tert-butyl trans-3-pentenoate = 3-Pentenoic acid, 1,1-dimethylethyl ester, (E)-

By formula: C9H16O2 = C9H16O2

Quantity Value Units Method Reference Comment
Δr-7.5 ± 0.8kJ/molEqkHine, Kanagasabapathy, et al., 1982liquid phase

References

Hine, Kanagasabapathy, et al., 1982
Hine, J.; Kanagasabapathy, V.M.; Ng, P., Double bond stabilizing abilities of formyl, carbo-tert-butoxy, and carbomethoxy substituents, J. Org. Chem., 1982, 47, 2745-2748. [all data]