1-Isopropyl-8-methylnaphthalene

Condensed phase thermochemistry data

Data compiled by: Hussein Y. Afeefy, Joel F. Liebman, and Stephen E. Stein

Quantity Value Units Method Reference Comment
Δfliquid2.9 ± 1.3kJ/molCcbSmith, Gammon, et al., 1982
Quantity Value Units Method Reference Comment
Δcliquid-7798.6 ± 1.0kJ/molCcbSmith, Gammon, et al., 1982Corresponding Δfliquid = 2.8 kJ/mol (simple calculation by NIST; no Washburn corrections)

References

Smith, Gammon, et al., 1982
Smith, N.K.; Gammon, B.E.; Good, W.D., Thermodynamics of organic compounds, Gov. Rep. Announce. Index (U.S.). Avail. NTIS AD-A110430, 1981., 1982, 82, 2252. [all data]