HSrOH

Vibrational and/or electronic energy levels

Data compiled by: Marilyn E. Jacox

State:   X

Vib.
sym.
 No.   Approximate
 type of mode
 cm-1   Med.   Method   References

Σ+ 2 SrH stretch 1143.2 Ar IR Kauffman, Hauge, et al., 1984
3 SrO stretch 498.2 Ar IR Kauffman, Hauge, et al., 1984
Wang and Andrews, 2005

Additional references: Jacox, 1994, page 134

References

Kauffman, Hauge, et al., 1984
Kauffman, J.W.; Hauge, R.H.; Margrave, J.L., High Temp. Sci., 1984, 18, 97. [all data]

Wang and Andrews, 2005
Wang, X.; Andrews, L., Infrared Spectra and Electronic Structure Calculations for the Group 2 Metal M(OH), J. Phys. Chem. A, 2005, 109, 12, 2782, https://doi.org/10.1021/jp044660s . [all data]

Jacox, 1994
Jacox, M.E., Vibrational and electronic energy levels of polyatomic transient molecules, American Chemical Society, Washington, DC, 1994, 464. [all data]