CH3SiH2SiH(CH3)2

Gas phase ion energetics data

Data compiled by: Sharon G. Lias, Rhoda D. Levin, and Sherif A. Kafafi

Appearance energy determinations

Ion AE (eV) Other Products MethodReferenceComment
C2H6Si+10.8 ± 0.1CH3SiH3EIPotzinger, Ritter, et al., 1975

References

Potzinger, Ritter, et al., 1975
Potzinger, P.; Ritter, A.; Krause, J., Massenspektrometrische Bestimmung von Bindungsenergien in siliciumorganischen Verbindungen, Z. Naturforsch. A:, 1975, 30, 347. [all data]