1,2-Propanedithiol

Kovats' RI, non-polar column, isothermal

View large format table.

Column type Active phase Temperature (C) I Reference Comment
PackedApiezon M130.895.Garbuzov, Misharina, et al., 1985He or N2, Chromosorb W, AW-DMCS; Column length: 2.1 m
PackedOV-101130.873.Zygmunt, Wardencki, et al., 1983Ar, Gas-Chrom Q; Column length: 1.5 m
PackedOV-101130.880.Zygmunt, Wardencki, et al., 1983Ar, Gas-Chrom Q; Column length: 1.5 m

Kovats' RI, non-polar column, custom temperature program

View large format table.

Column type Active phase I Reference Comment
CapillaryApiezon M895.Zhu, Wang, et al., 2007Program: not specified

Kovats' RI, polar column, custom temperature program

View large format table.

Column type Active phase I Reference Comment
CapillaryPEG-20M1355.Zhu, Wang, et al., 2007Program: not specified

Normal alkane RI, non-polar column, custom temperature program

View large format table.

Column type Active phase I Reference Comment
CapillaryTR-5 MS832.Kurashov, Mitrukova, et al., 201415. m/0.25 mm/0.25 μm, Helium; Program: 35 0C (3 min) 2 0C/min -> 60 0C (3 min) 2 0C/min -> 80 0C (3 min) 4 0C/min -> 120 0C (3 min) 5 0C/min -> 150 0C (3 min) 15 0C/min -> 240 0C (10 min)

References

Garbuzov, Misharina, et al., 1985
Garbuzov, V.G.; Misharina, T.A.; Aerov, A.F.; Golovnya, R.V., Gas chromatographic retention indices for sulphur(II)-containing organic substances, J. Anal. Chem. USSR (Engl. Transl.), 1985, 40, 4, 576-586. [all data]

Zygmunt, Wardencki, et al., 1983
Zygmunt, B.; Wardencki, W.; Staszewski, R., Gas chromatographic identification of thiols in the naphta cut from Libyan crude oil, J. Chromatogr., 1983, 265, 136-138, https://doi.org/10.1016/S0021-9673(01)96709-3 . [all data]

Zhu, Wang, et al., 2007
Zhu, X.H.; Wang, W.; Schramm, K.-W.; Niu, W., Prediction of the Kova´ ts Retention Indices of Thiols by Use of Quantum Chemical and Physicochemical Descriptors, Chromatographia, 2007, 65, 11-12, 719-724, https://doi.org/10.1365/s10337-007-0237-3 . [all data]

Kurashov, Mitrukova, et al., 2014
Kurashov, E.A.; Mitrukova, G.G.; Krylova, Yu.V., Variations in the component composition of essential oil of Ceratophyllum demersum (Ceratophyllaceae) during vegetation (in press), Plant Resources (Rastitel'nye Resursy), 2014, 1, 000-000. [all data]