Cholanic acid, 3β,7α-dihydroxy, Me-TMS

Normal alkane RI, non-polar column, isothermal

View large format table.

Column type Active phase Temperature (C) I Reference Comment
CapillaryOV-1270.3190.Lawson and Setchell, 198818. m/0.20 mm/0.25 μm, He

Normal alkane RI, non-polar column, custom temperature program

View large format table.

Column type Active phase I Reference Comment
CapillaryUltra-13155.Axelson, Ellis, et al., 200025. m/0.32 mm/0.17 μm, H2; Program: 50 0C (3 min) -> 185 0C 5 K/min -> 280 0C
CapillaryOV-13190.Iida, Momose, et al., 198718. m/0.20 mm/0.25 μm, He; Program: not specified

Normal alkane RI, polar column, custom temperature program

View large format table.

Column type Active phase I Reference Comment
CapillaryDB-Wax3536.Iida, Momose, et al., 198715. m/0.25 mm/0.25 μm, He; Program: not specified

References

Lawson and Setchell, 1988
Lawson, A.M.; Setchell, K.D.R., Appendix of GC retention indices. List of retention indices foe methyl ester - trimethylsilyl (Me-TMS) ether derivatives of bile acids, The Bile Acids. Vol. 4, Methods and Applications, 1988, 4, 571-575. [all data]

Axelson, Ellis, et al., 2000
Axelson, M.; Ellis, E.; Mörk, B.; Garmark, K.; Abrahamsson, A.; Björkhem, I.; Ericzon, B.-G.; Einarsson, C., Bile acid synthesis in cultured human hepatocytes: support for an alternative biosynthetic pathway to cholic acid, Hepatology, 2000, 31, 6, 1305-1312, https://doi.org/10.1053/jhep.2000.7877 . [all data]

Iida, Momose, et al., 1987
Iida, T.; Momose, T.; Tamura, T.; Matsumoto, T.; Goto, J.; Nambara, T.; Chang, F.C., Capillary gas chromatography of hydroxylated bile acid stereoisomers of the allo and normal series, J. Chromatogr., 1987, 389, 155-164, https://doi.org/10.1016/S0021-9673(01)94419-X . [all data]