Methyl 4,4-dichlorobutanoate

Kovats' RI, non-polar column, isothermal

View large format table.

Column type Active phase Temperature (C) I Reference Comment
CapillaryOV-101100.1045.Haken and Korhonen, 1984N2; Column length: 25. m; Column diameter: 0.3 mm
CapillaryOV-101120.1037.Haken and Korhonen, 1984N2; Column length: 25. m; Column diameter: 0.3 mm
CapillaryOV-10180.1047.Haken and Korhonen, 1984N2; Column length: 25. m; Column diameter: 0.3 mm

References

Haken and Korhonen, 1984
Haken, J.K.; Korhonen, I.O.O., Gas chromatography of homologous esters. XXIV. Studies of chlorinated methyl propanoates and butanoates on a non-polar capillary column, J. Chromatogr., 1984, 284, 474-477, https://doi.org/10.1016/S0021-9673(01)87849-3 . [all data]