(Pentafluoroethyl)trimethyltin

Phase change data

Data compiled by: William E. Acree, Jr., James S. Chickos

Enthalpy of vaporization

ΔvapH (kcal/mol) Temperature (K) Method Reference Comment
8.51312.TKaesz, Phillips, et al., 1960Based on data from 295. - 329. K.

References

Kaesz, Phillips, et al., 1960
Kaesz, H.D.; Phillips, J.R.; Stone, F.G.A., Preparation and Study of Some Perfluoroalkyl Compounds of Tin and Lead 1,2, J. Am. Chem. Soc., 1960, 82, 24, 6228-6232, https://doi.org/10.1021/ja01509a004 . [all data]