2-Chloroethyl vinyl sulfide

Van Den Dool and Kratz RI, non-polar column, temperature ramp

View large format table.

Column type Active phase I Reference Comment
CapillaryOV-1874.Kostiainen, 200015. m/0.32 mm/0.25 μm, He, 50. C @ 2. min, 10. K/min, 280. C @ 10. min
CapillarySE-54903.Kostiainen, 200025. m/0.32 mm/0.25 μm, He, 40. C @ 1. min, 10. K/min, 280. C @ 10. min
CapillaryDB-1874.D'agostino and Provost, 198815. m/0.32 mm/0.25 μm, He, 50. C @ 2. min, 10. K/min, 300. C @ 5. min
CapillaryDB-5903.D'agostino and Provost, 198815. m/0.32 mm/0.25 μm, 50. C @ 2. min, 10. K/min, 300. C @ 5. min

Normal alkane RI, non-polar column, temperature ramp

View large format table.

Column type Active phase I Reference Comment
CapillaryHP-5920.Mazurek, Witkiewicz, et al., 2001He, 40. C @ 3. min, 10. K/min, 280. C @ 30. min; Column length: 30. m; Column diameter: 0.32 mm

Normal alkane RI, non-polar column, custom temperature program

View large format table.

Column type Active phase I Reference Comment
CapillaryDB-1874.Tarjan, Nyiredy, et al., 1989Program: not specified

References

Kostiainen, 2000
Kostiainen, O., Gas Chromatography in Screening of Chemicals Related to the Chemical Weapons Convention in Encyclopedia of Analytical Chemistry, Meyers, R.A., ed(s)., John Wiley Sons Ltd, Chichester, 2000, 963-979. [all data]

D'agostino and Provost, 1988
D'agostino, P.A.; Provost, L.R., Gas chromatographic retention indices of sulphur vesicants and related compounds, J. Chromatogr., 1988, 436, 399-411, https://doi.org/10.1016/S0021-9673(00)94599-0 . [all data]

Mazurek, Witkiewicz, et al., 2001
Mazurek, M.; Witkiewicz, Z.; Popiel, S.; Sliwakowski, M., Capillary gas chromatography-atomic emission spectroscopy-mass spectrometry analysis of sulphur mustard and transformation products in a block recovered from the Baltic Sea, J. Chromatogr. A, 2001, 919, 1, 133-145, https://doi.org/10.1016/S0021-9673(01)00672-0 . [all data]

Tarjan, Nyiredy, et al., 1989
Tarjan, G.; Nyiredy, Sz.; Gyor, M.; Lombosi, E.R.; Lombosi, T.S.; Budahegyi, M.V.; Meszaros, S.Y.; Takacs, J.M., Review. Thirtieth Anniversary of the Retention Index According to Kovats in Gas-Liquid Chromatography, J. Chromatogr., 1989, 472, 1-92, https://doi.org/10.1016/S0021-9673(00)94099-8 . [all data]