Musk ketone

Phase change data

Data compiled by: William E. Acree, Jr., James S. Chickos

Enthalpy of sublimation

ΔsubH (kJ/mol) Temperature (K) Method Reference Comment
107.9323.MESerpinskii, Voitkevich, et al., 1953Based on data from 293. - 353. K. See also Jones, 1960.

Enthalpy of fusion

ΔfusH (kJ/mol) Temperature (K) Reference
23.81408.5Qu, Bai, et al., 2004

References

Serpinskii, Voitkevich, et al., 1953
Serpinskii, V.V.; Voitkevich, S.A.; Lyuboshits, N.Y., Zh. Fiz. Khim., 1953, 27, 1032. [all data]

Jones, 1960
Jones, A.H., Sublimation Pressure Data for Organic Compounds., J. Chem. Eng. Data, 1960, 5, 2, 196-200, https://doi.org/10.1021/je60006a019 . [all data]

Qu, Bai, et al., 2004
Qu, H.; Bai, P.; Yang, Z.; Yu, G., Chin. J. Chem. Eng., 2004, 12, 2, 294. [all data]