PS2

Vibrational and/or electronic energy levels

Data compiled by: Marilyn E. Jacox

State:   X

Vib.
sym.
 No.   Approximate
 type of mode
 cm-1   Med.   Method   References

b2 3 Asym. stretch 744.1 Ar IR Mielke, Brabson, et al., 1991

Additional references: Jacox, 1994, page 95

References

Mielke, Brabson, et al., 1991
Mielke, Z.; Brabson, G.D.; Andrews, L., Matrix infrared spectra of the phosphorus sulfides PS, P2S and PS2, J. Phys. Chem., 1991, 95, 1, 75, https://doi.org/10.1021/j100154a018 . [all data]

Jacox, 1994
Jacox, M.E., Vibrational and electronic energy levels of polyatomic transient molecules, American Chemical Society, Washington, DC, 1994, 464. [all data]