2-Hepten-4-one, 2-hydroxy-6-methyl-

Reaction thermochemistry data

Data compiled by: Hussein Y. Afeefy, Joel F. Liebman, and Stephen E. Stein

Individual Reactions

2,4-Heptanedione, 6-methyl- = 2-Hepten-4-one, 2-hydroxy-6-methyl-

By formula: C8H14O2 = C8H14O2

Quantity Value Units Method Reference Comment
Δr-3.3kcal/molEqkCalmon, 1969liquid phase; NMR

References

Calmon, 1969
Calmon, J.P., Thermodynamic functions of enolization of aliphatic β-diketones, C. R. Acad. Sci. Paris, 1969, 268, 1435-1438. [all data]