Presilphiperfol-7-ene

Van Den Dool and Kratz RI, non-polar column, temperature ramp

Data compiled by: NIST Mass Spectrometry Data Center, William E. Wallace, director

Column type CapillaryCapillaryCapillaryCapillary
Active phase RTX-1SPB-1DB-5RTX-1
Column length (m) 60.30.30.60.
Carrier gas HeHeHeHe
Substrate
Column diameter (mm) 0.220.250.20.22
Phase thickness (μm) 0.250.250.250.25
Tstart (C) 60.50.50.60.
Tend (C) 230.250.250.230.
Heat rate (K/min) 2.5.5.2.
Initial hold (min)  3.3.
Final hold (min) 35.15.15.35.
I 1335.1317.1328.1335.
ReferencePaolini J., Costa J., et al., 2007Blagojevic, Radulovic, et al., 2006Blagojevic, Radulovic, et al., 2006Paolini, Costa, et al., 2005
Comment MSDC-RI MSDC-RI MSDC-RI MSDC-RI

Van Den Dool and Kratz RI, polar column, temperature ramp

Data compiled by: NIST Mass Spectrometry Data Center, William E. Wallace, director

Column type CapillaryCapillary
Active phase RTX-WaxRTX-Wax
Column length (m) 60.60.
Carrier gas HeHe
Substrate
Column diameter (mm) 0.220.22
Phase thickness (μm) 0.250.25
Tstart (C) 60.60.
Tend (C) 230.230.
Heat rate (K/min) 2.2.
Initial hold (min)
Final hold (min) 35.35.
I 1414.1414.
ReferencePaolini J., Costa J., et al., 2007Paolini, Costa, et al., 2005
Comment MSDC-RI MSDC-RI

Normal alkane RI, non-polar column, temperature ramp

Data compiled by: NIST Mass Spectrometry Data Center, William E. Wallace, director

Column type CapillaryCapillaryCapillaryCapillary
Active phase Optima-5VF-5MSBP-1OV-101
Column length (m) 30.30.50.30.
Carrier gas HeliumHelium N2
Substrate
Column diameter (mm) 0.250.250.220.25
Phase thickness (μm) 0.250.250.25
Tstart (C) 60.240.60.100.
Tend (C) 246.320.220.220.
Heat rate (K/min) 3.20.2.5.
Initial hold (min) 1.1.
Final hold (min)   20.
I 1333.1338.1338.1345.
ReferenceAl-Qudah, Muhaidat, et al., 2012Kowalski, 2008Blanc, Muselli, et al., 2004Menut, Lamaty, et al., 1997
Comment MSDC-RI MSDC-RI MSDC-RI MSDC-RI

References

Paolini J., Costa J., et al., 2007
Paolini J.; Costa J.; Bernardini A.F., Analysis of the essential oil from the roots of Eupatorium cannabinum subsp corsicum (L.) by GC, GC-MS and C-13-NMR, Phytochem. Anal., 2007, 18, 3, 235-244, https://doi.org/10.1002/pca.977 . [all data]

Blagojevic, Radulovic, et al., 2006
Blagojevic, P.; Radulovic, N.; Palic, R.; Stojanovic, G., Chemical composition of the essential oils of Serbian wild-growing Srtemisia absinthium and Artemisia vulgaris, J. Agric. Food Chem., 2006, 54, 13, 4780-4789, https://doi.org/10.1021/jf060123o . [all data]

Paolini, Costa, et al., 2005
Paolini, J.; Costa, J.; Bernardini, A., Analysis of the essential oil from aerial parts of Eupatorium cannabinum subsp. corsicum (L.) by gas chromatography with electron impact and chemical ionization mass spectrometry, J. Chromatogr. A, 2005, 1076, 1-2, 170-178, https://doi.org/10.1016/j.chroma.2005.03.131 . [all data]