Dicyclopenta[cd,lm]perylene

Gas phase thermochemistry data

Data compiled by: Glushko Thermocenter, Russian Academy of Sciences, Moscow

Constant pressure heat capacity of gas

Cp,gas (J/mol*K) Temperature (K) Reference Comment
48.8150.Dorofeeva O.V., 1989These statistically calculated values were obtained using force field approximation for polycyclic aromatic hydrocarbons to estimate the needed vibrational frequencies (see also [ Dorofeeva O.V., 1986, Moiseeva N.F., 1990]). These functions are reproduced in the reference book [ Frenkel M., 1994].
85.58100.
131.77150.
184.11200.
263.75273.15
290.5 ± 7.0298.15
292.43300.
391.07400.
472.78500.
537.93600.
589.71700.
631.28800.
665.10900.
692.951000.
716.111100.
735.531200.
751.951300.
765.921400.
777.871500.

References

Dorofeeva O.V., 1989
Dorofeeva O.V., Thermodynamic Properties of Gaseous Polycyclic Aromatic Hydrocarbons Containing Five-Membered Rings. Institute for High Temperatures, USSR Academy of Sciences, Preprint No.1-263 (in Russian), Moscow, 1989. [all data]

Dorofeeva O.V., 1986
Dorofeeva O.V., On calculation of thermodynamic properties of polycyclic aromatic hydrocarbons, Thermochim. Acta, 1986, 102, 59-66. [all data]

Moiseeva N.F., 1990
Moiseeva N.F., Group additivity scheme for calculating the chemical thermodynamic properties of gaseous polycyclic aromatic hydrocarbons containing five-membered rings, Thermochim. Acta, 1990, 168, 179-186. [all data]

Frenkel M., 1994
Frenkel M., Thermodynamics of Organic Compounds in the Gas State, Vol. I, II, Thermodynamics Research Center, College Station, Texas, 1994, 1994. [all data]