Solanid-5-en-3-ol, (3β)-

Kovats' RI, non-polar column, isothermal

Data compiled by: NIST Mass Spectrometry Data Center, William E. Wallace, director

Column type CapillaryCapillary
Active phase CP Sil 5 CBCP Sil 5 CB
Column length (m) 25.50.
Carrier gas HeH2
Substrate
Column diameter (mm) 0.220.22
Phase thickness (μm) 0.120.12
Temperature (C) 270.270.
I 3130.3129.
Referencevan Gelder, Tuinstra, et al., 1989van Gelder, Jonker, et al., 1988
Comment MSDC-RI MSDC-RI

References

van Gelder, Tuinstra, et al., 1989
van Gelder, W.M.J.; Tuinstra, L.G.M.Th.; van der Greef, J.; Scheffer, J.J.C., Characterization of Novel Steroidal Alkaloids from Tubers of Solanum Species by Combined Gas Chromatography-Mass Spectrometry. Implications For Potato Breeding, J. Chromatogr., 1989, 482, 1, 13-22, https://doi.org/10.1016/S0021-9673(01)93203-0 . [all data]

van Gelder, Jonker, et al., 1988
van Gelder, W.M.J.; Jonker, H.H.; Huizing, H.J.; Scheffer, J.J.C., Capillary gas chromatography of steroidal alkaloids from Solanaceae. Retention indices and simultaneous flame ionization/nitrogen-specific detection, J. Chromatogr., 1988, 442, 133-145, https://doi.org/10.1016/S0021-9673(00)94463-7 . [all data]