2-Cyclopenten-1-one, 2-hydroxy-3-methyl-

Normal alkane RI, polar column, temperature ramp

Data compiled by: NIST Mass Spectrometry Data Center, William E. Wallace, director

Column type CapillaryCapillaryCapillaryCapillaryCapillary
Active phase HP-FFAPDB-WaxFFAPFFAPDB-Wax
Column length (m) 25.30.30.60.60.
Carrier gas HeliumHeliumNitrogenHeliumHelium
Substrate
Column diameter (mm) 0.320.250.320.250.25
Phase thickness (μm) 0.500.250.500.250.50
Tstart (C) 45.60.35.45.40.
Tend (C) 220.240.250.220.210.
Heat rate (K/min) 15.5.4.5.2.
Initial hold (min)  1.5.1.5.
Final hold (min)   45.5.70.
I 1861.1837.1829.1816.1860.
ReferenceWanakhachornkrai and Lertsiri, 9999Souza, Re-Poppi, et al., 2012Budryn, Nebesny, et al., 2011Piyachaiseth, Jirapakkul, et al., 2011Moon and Shibamoto, 2010
Comment MSDC-RI MSDC-RI MSDC-RI MSDC-RI MSDC-RI
Column type CapillaryCapillaryCapillaryCapillaryCapillary
Active phase DB-WaxFFAPDB-WaxTC-WaxDB-Wax
Column length (m) 60.30.30.60.60.
Carrier gas HeliumN2HeHe
Substrate
Column diameter (mm) 0.250.320.250.250.25
Phase thickness (μm) 0.500.5 0.5
Tstart (C) 40.35.60.40.60.
Tend (C) 210.320.180.230.180.
Heat rate (K/min) 2.4.2.3.3.
Initial hold (min) 5.5.5.8.4.
Final hold (min) 70.45.30.
I 1857.1829.1834.1832.1831.
ReferenceMoon and Shibamoto, 2009Nebesny, Budryn, et al., 2007Osada and Shibamoto, 2006Ishikawa, Ito, et al., 2004Ito, Sugimoto, et al., 2002
Comment MSDC-RI MSDC-RI MSDC-RI MSDC-RI MSDC-RI
Column type CapillaryCapillaryCapillaryCapillaryCapillary
Active phase DB-WaxCarbowax 20MDB-WaxDB-WaxCarbowax 20M
Column length (m) 30.50.30.60.50.
Carrier gas He HeHeHe
Substrate
Column diameter (mm) 0.250.250.320.250.33
Phase thickness (μm) 0.250.250.50.25
Tstart (C) 50.45.40.50.60.
Tend (C) 180.230.210.230.200.
Heat rate (K/min) 3.3.3.2.3.
Initial hold (min)   1.4.
Final hold (min) 40.30.25.
I 1807.1837.1799.1830.1830.
ReferenceLee and Shibamoto, 2000Cutzach, Chatonnet, et al., 1997Pollak and Berger, 1996Shimoda, Shiratsuchi, et al., 1993Vernin, Metzger, et al., 1992
Comment MSDC-RI MSDC-RI MSDC-RI MSDC-RI MSDC-RI
Column type Capillary
Active phase FFAP
Column length (m) 50.
Carrier gas He
Substrate
Column diameter (mm) 0.28
Phase thickness (μm)
Tstart (C) 60.
Tend (C) 240.
Heat rate (K/min) 2.
Initial hold (min) 5.
Final hold (min)
I 1800.
ReferenceVernin, Metzger, et al., 1988
Comment MSDC-RI

Van Den Dool and Kratz RI, polar column, custom temperature program

Data compiled by: NIST Mass Spectrometry Data Center, William E. Wallace, director

Column type CapillaryCapillary
Active phase StabilwaxFFAP
Column length (m) 30.25.
Carrier gas HeHe
Substrate
Column diameter (mm) 0.250.32
Phase thickness (μm) 0.250.5
Program 40C => 3C/min => 100C => 5C/min => 240C(10min)35C (2min) => 40C/min => 60C => 6C/min => 230C (10min)
I 1839.1830.
ReferenceNatali N., Chinnici F., et al., 2006Fickert and Schieberle, 1998
Comment MSDC-RI MSDC-RI

Lee's RI, non-polar column, temperature ramp

Data compiled by: NIST Mass Spectrometry Data Center, William E. Wallace, director

Column type Capillary
Active phase DB-5
Column length (m) 25.
Carrier gas He
Substrate
Column diameter (mm) 0.3
Phase thickness (μm)
Tstart (C) 60.
Tend (C) 270.
Heat rate (K/min) 5.
Initial hold (min) 2.
Final hold (min)
I 166.55
ReferenceWilliams and Horne, 1995
Comment MSDC-RI

References

Wanakhachornkrai and Lertsiri, 9999
Wanakhachornkrai, P.; Lertsiri, S., Comparison of determination method for volatile compounds in Thai soy sauce, Analytical, Nutritional and Clinical Methods, 9999, 1-11. [all data]

Souza, Re-Poppi, et al., 2012
Souza, J.B.G.; Re-Poppi, N.; Raposo, J.L.(Jr)., Characterization of pyroligneous acid used in agriculture by gas chromatography - mass spectrometry (in press), J. Braz. Chem. Soc., 2012, 00, 00, 1-8. [all data]

Budryn, Nebesny, et al., 2011
Budryn, G.; Nebesny, E.; Kula, J.; Majda, T.; Krysiak, W., HS-SPME/GC/MS Profiles of convectively and microwave roasted Ivory Coast Robusta coffee brews, Czech. J. Food Sci., 2011, 29, 2, 151-160. [all data]

Piyachaiseth, Jirapakkul, et al., 2011
Piyachaiseth, T.; Jirapakkul, W.; Chaiseri, S., Aroma compounds of flash-fried rice, Kasetsart J. (Nat. Sci.), 2011, 45, 717-729. [all data]

Moon and Shibamoto, 2010
Moon, J.-K.; Shibamoto, T., Formation of volatile chemicals from thermal degradation of less volatile cofee components: quinic acid, caffeic acid, and chlorogenic acid, J. Agric. Food Chem., 2010, 58, 9, 5465-5470, https://doi.org/10.1021/jf1005148 . [all data]

Moon and Shibamoto, 2009
Moon, J.-K.; Shibamoto, T., Role of roasting conditions in the profile of volatile flavor chemicals formed from coffee beans, J. Agric. Food Chem., 2009, 57, 13, 5823-5831, https://doi.org/10.1021/jf901136e . [all data]

Nebesny, Budryn, et al., 2007
Nebesny, E.; Budryn, G.; Kula, J.; Majda, T., The effect of roasting method on headspace composition of robusta coffee bean aroma, Eur. Food Res. Technol., 2007, 225, 1, 9-19, https://doi.org/10.1007/s00217-006-0375-0 . [all data]

Osada and Shibamoto, 2006
Osada, Y.; Shibamoto, T., Antioxidative activity of volatile extracts from Maillard model systems, Food Chem., 2006, 98, 3, 522-528, https://doi.org/10.1016/j.foodchem.2005.05.084 . [all data]

Ishikawa, Ito, et al., 2004
Ishikawa, M.; Ito, O.; Ishizaki, S.; Kurobayashi, Y.; Fujita, A., Solid-phase aroma concentrate extraction (SPACE ): a new headspace technique for more sensitive analysis of volatiles, Flavour Fragr. J., 2004, 19, 3, 183-187, https://doi.org/10.1002/ffj.1322 . [all data]

Ito, Sugimoto, et al., 2002
Ito, Y.; Sugimoto, A.; Kakuda, T.; Kubota, K., Identification of potent odorants in Chinese jasmine green tea scented with flowers of Jasminum sambac, J. Agric. Food Chem., 2002, 50, 17, 4878-4884, https://doi.org/10.1021/jf020282h . [all data]

Lee and Shibamoto, 2000
Lee, K.-G.; Shibamoto, T., Antioxidant properties of aroma compounds isolated from soybeans and mung beans, J. Agric. Food Chem., 2000, 48, 9, 4290-4293, https://doi.org/10.1021/jf000442u . [all data]

Cutzach, Chatonnet, et al., 1997
Cutzach, I.; Chatonnet, P.; Henry, R.; Dubourdieu, D., Identification of volatile compounds with a Toasty aroma in heated oak used in barrelmaking, J. Agric. Food Chem., 1997, 45, 6, 2217-2224, https://doi.org/10.1021/jf960947d . [all data]

Pollak and Berger, 1996
Pollak, F.C.; Berger, R.G., Geosmin and Related Volatiles in Bioreactor-Cultured Streptomyces citreus CBS 109.60, Appl. Environ. Microbiol., 1996, 62, 4, 1295-1299. [all data]

Shimoda, Shiratsuchi, et al., 1993
Shimoda, M.; Shiratsuchi, H.; Minegishi, Y.; Osajima, Y., Flavor deterioration of nonfermented coarse-cut sausage during storage. Flavor as a factor of quality for nonfermented sausage. 2, J. Agric. Food Chem., 1993, 41, 6, 946-950, https://doi.org/10.1021/jf00030a021 . [all data]

Vernin, Metzger, et al., 1992
Vernin, G.; Metzger, J.; Boniface, C.; Murello, M.-H.; Siouffi, A.; Larice, J.-L.; Parkanyi, C., Kinetics and thermal degradation of the fructose-methionine Amadori intermediates. GC-MS/SPECMA data bank identification of volatile aroma compounds, Carbohyd. Res., 1992, 230, 1, 15-29, https://doi.org/10.1016/S0008-6215(00)90510-X . [all data]

Vernin, Metzger, et al., 1988
Vernin, G.; Metzger, J.; Obretenov, T.; Suon, K.-N.; Fraisse, D., GC/MS (EI,PCI,SIM)-data bank analysis of volatile compounds arising from thermal degradation of glucose-valine amadori intermediates in Flavors and Fragrances: A World Perspective. Proceedings of the 10th International Congress of Essential Oils, Fragrances and Flavors, Lawrence,B.M.; Mookherjee,B.D.; Willis,B.J., ed(s)., Elsevier, New York, 1988, 999-1028. [all data]