Tiglic acid

Phase change data

Data compiled as indicated in comments:
BS - Robert L. Brown and Stephen E. Stein
TRC - Thermodynamics Research Center, NIST Boulder Laboratories, Chris Muzny director
AC - William E. Acree, Jr., James S. Chickos

Quantity Value Units Method Reference Comment
Tboil471.7KN/AWeast and Grasselli, 1989BS
Quantity Value Units Method Reference Comment
Tfus336.7KN/ADrake and Spies, 1935Uncertainty assigned by TRC = 1.5 K; TRC
Quantity Value Units Method Reference Comment
Tc680.62KN/AD'Souza and Teja, 1987Uncertainty assigned by TRC = 3. K; Ambrose's procedure; TRC
Quantity Value Units Method Reference Comment
Pc48.5797barN/AD'Souza and Teja, 1987Uncertainty assigned by TRC = 1.00 bar; Ambrose's procedure; TRC

Enthalpy of vaporization

ΔvapH (kJ/mol) Temperature (K) Method Reference Comment
61.2365.AStephenson and Malanowski, 1987Based on data from 350. - 453. K.; AC

Antoine Equation Parameters

log10(P) = A − (B / (T + C))
    P = vapor pressure (bar)
    T = temperature (K)

View plot Requires a JavaScript / HTML 5 canvas capable browser.

Temperature (K) A B C Reference Comment
325. - 471.75.697732488.304-34.886Stull, 1947Coefficents calculated by NIST from author's data.

In addition to the Thermodynamics Research Center (TRC) data available from this site, much more physical and chemical property data is available from the following TRC products:

Normal alkane RI, non-polar column, temperature ramp

View large format table.

Column type Active phase I Reference Comment
CapillaryDB-5941.Wu, Krings, et al., 200530. m/0.32 mm/0.25 μm, He, 40. C @ 2. min, 5. K/min, 250. C @ 10. min
CapillaryDB-5941.Wu, Krings, et al., 200530. m/0.32 mm/0.25 μm, He, 40. C @ 2. min, 5. K/min, 250. C @ 10. min
CapillaryOV-101946.Zenkevich, 200525. m/0.20 mm/0.10 μm, N2/He, 6. K/min; Tstart: 50. C; Tend: 250. C

Normal alkane RI, polar column, temperature ramp

View large format table.

Column type Active phase I Reference Comment
CapillaryZB-Wax1862.Wu, Krings, et al., 200530. m/0.32 mm/0.25 μm, He, 40. C @ 2. min, 5. K/min, 250. C @ 10. min
CapillaryDB-Wax1867.Wu, Krings, et al., 200530. m/0.32 mm/0.25 μm, H2, 40. C @ 2. min, 5. K/min, 230. C @ 15. min
CapillaryZB-Wax1862.Wu, Krings, et al., 200530. m/0.32 mm/0.25 μm, He, 40. C @ 2. min, 5. K/min, 250. C @ 10. min
CapillaryTC-Wax1838.Suhardi, Suzuki, et al., 200260. m/0.25 mm/0.25 μm, He, 40. C @ 10. min, 3. K/min, 230. C @ 10. min

References

Weast and Grasselli, 1989
CRC Handbook of Data on Organic Compounds, 2nd Editon, Weast,R.C and Grasselli, J.G., ed(s)., CRC Press, Inc., Boca Raton, FL, 1989, 1. [all data]

Drake and Spies, 1935
Drake, N.L.; Spies, J.R., Cotton Resin III. The Combined Acids, J. Am. Chem. Soc., 1935, 57, 184-7. [all data]

D'Souza and Teja, 1987
D'Souza, R.; Teja, A.S., The prediction of the vapor pressures of carboxylic acids, Chem. Eng. Commun., 1987, 61, 13. [all data]

Stephenson and Malanowski, 1987
Stephenson, Richard M.; Malanowski, Stanislaw, Handbook of the Thermodynamics of Organic Compounds, 1987, https://doi.org/10.1007/978-94-009-3173-2 . [all data]

Stull, 1947
Stull, Daniel R., Vapor Pressure of Pure Substances. Organic and Inorganic Compounds, Ind. Eng. Chem., 1947, 39, 4, 517-540, https://doi.org/10.1021/ie50448a022 . [all data]

Wu, Krings, et al., 2005
Wu, S.; Krings, U.; Zorn, H.; Berger, R.G., Volatile compounds from the fruiting bodies of beefsteak fungus Fistulina hepatica (Schaeffer: Fr.) Fr., Food Chem., 2005, 92, 2, 221-226, https://doi.org/10.1016/j.foodchem.2004.07.013 . [all data]

Zenkevich, 2005
Zenkevich, I.G., Experimentally measured retention indices., 2005. [all data]

Suhardi, Suzuki, et al., 2002
Suhardi, S.; Suzuki, M.; Yoshida, K.; Muto, T.; Fujita, A.; Watanbe, N., Changes in the volatile compounds and in the chemical and physical properties of snake fruit (Salacca edulis Reinw) Cv. Pondoh during maturation, J. Agric. Food Chem., 2002, 50, 26, 7627-7633, https://doi.org/10.1021/jf020620e . [all data]