Tricyclo[8.2.2.24,7]hexadeca-4,6,10,12,13,15-hexaene, 5,6,11-trimethyl-

Gas phase ion energetics data

Data compiled as indicated in comments:
LLK - Sharon G. Lias, Rhoda D. Levin, and Sherif A. Kafafi

Ionization energy determinations

IE (eV) Method Reference Comment
7.3PEZhong-zhi, Kovak, et al., 1981LLK
7.70 ± 0.05PEZhong-zhi, Kovak, et al., 1981Vertical value; LLK

References

Zhong-zhi, Kovak, et al., 1981
Zhong-zhi, Y.; Kovak, B.; Heilbronner, E.; Eltamany, S.; Hopf, H., 192. Ionization energies of methyl-substituted [2.2] paracyclophanes, Helv. Chim. Acta, 1981, 64, 1991. [all data]