Lilial

Kovats' RI, non-polar column, isothermal

View large format table.

Column type Active phase Temperature (C) I Reference Comment
CapillarySE-30100.1500.0Tudor, 199740. m/0.35 mm/0.35 μm

Van Den Dool and Kratz RI, non-polar column, custom temperature program

View large format table.

Column type Active phase I Reference Comment
CapillaryBPX-51535.Mondello, Casilli, et al., 200530. m/0.25 mm/0.25 μm, He; Program: 50C => 1.5C/min => 230C => 15C/min => 260C
CapillarySE-521533.Mondello, Dugo, et al., 199560. m/0.32 mm/0.40 μm, He; Program: 45 C (6 min) 3 C/min -> 111 0C 2 C/min -> 160 C 3 C/min -> 300 C (15 min)

Normal alkane RI, non-polar column, temperature ramp

View large format table.

Column type Active phase I Reference Comment
CapillaryHP-5 MS1532.Radulovic, Blagojevic, et al., 201030. m/0.25 mm/0.25 μm, Helium, 5. K/min, 290. C @ 10. min; Tstart: 70. C
CapillaryEquity-5 MS1535.Mondello, Casilli, et al., 200830. m/0.25 mm/0.25 μm, Helium, 1.5 K/min; Tstart: 40. C; Tend: 260. C
CapillarySPB-51549.Vasta, Ratel, et al., 200760. m/0.32 mm/1. μm, 40. C @ 5. min, 3. K/min, 230. C @ 5. min

Normal alkane RI, non-polar column, custom temperature program

View large format table.

Column type Active phase I Reference Comment
CapillaryHP-5MS1529.Alissandrakis, Kibaris, et al., 200530. m/0.25 mm/0.25 μm, He; Program: 40C(3min) => 2C/min => 180C => 10C/min => 250C(5min)

References

Tudor, 1997
Tudor, E., Temperature dependence of the retention index for perfumery compounds on a SE-30 glass capillary column. I. Linear equations, J. Chromatogr. A, 1997, 779, 1-2, 287-297, https://doi.org/10.1016/S0021-9673(97)00453-6 . [all data]

Mondello, Casilli, et al., 2005
Mondello, L.; Casilli, A.; Tranchida, P.Q.; Dugo, G.; Dugo, P., Comprehensive two-dimensional gas chromatography in combination with rapid scanning quadrupole mass spectrometry in perfume analysis, J. Chromatogr. A, 2005, 1067, 1-2, 235-243, https://doi.org/10.1016/j.chroma.2004.09.040 . [all data]

Mondello, Dugo, et al., 1995
Mondello, L.; Dugo, P.; Basile, A.; Dugo, G., Interactive use of linear retention indices, on polar and apolar columns, with a MS-library for reliable identification of complex mixtures, J. Microcolumn Sep., 1995, 7, 6, 581-591, https://doi.org/10.1002/mcs.1220070605 . [all data]

Radulovic, Blagojevic, et al., 2010
Radulovic, N.; Blagojevic, P.; Palic, R., Comparative study of the leaf volatiles of Arctostaphylos uva-ursi (L.) Spreng. and Vaccinium vitis-idaea L. (Ericaceae), Molecules, 2010, 15, 9, 6168-6185, https://doi.org/10.3390/molecules15096168 . [all data]

Mondello, Casilli, et al., 2008
Mondello, L.; Casilli, A.; Tranchida, Q.; Sciarrone, D.; Dugo, P.; Dugo, G., Analysis of allergens in fragrances using multiple heart-cut multidimentional gas chromatography - mass spectrometry, LC-GC Europe, 2008, 21, 130. [all data]

Vasta, Ratel, et al., 2007
Vasta, V.; Ratel, J.; Engel, E., Mass Spectrometry Analysis of Volatile Compounds in Raw Meat for the Authentication of the Feeding Background of Farm Animals, J. Agric. Food Chem., 2007, 55, 12, 4630-4639, https://doi.org/10.1021/jf063432n . [all data]

Alissandrakis, Kibaris, et al., 2005
Alissandrakis, E.; Kibaris, A.C.; Tarantilis, P.A.; Harizanis, P.C.; Polissiou, M., Flavour compounds of Greek cotton honey, J. Sci. Food Agric., 2005, 85, 9, 1444-1452, https://doi.org/10.1002/jsfa.2124 . [all data]