2,4-Hexadienal

Normal alkane RI, polar column, temperature ramp

Data compiled by: NIST Mass Spectrometry Data Center, William E. Wallace, director

Column type CapillaryCapillaryCapillaryCapillary
Active phase DB-WaxSupelcowax-10Supelcowax-10HP-FFAP
Column length (m) 60.30.30.25.
Carrier gas HeHeHe
Substrate
Column diameter (mm) 0.250.250.250.32
Phase thickness (μm) 0.250.250.250.52
Tstart (C) 40.40.40.60.
Tend (C) 210.200.200.240.
Heat rate (K/min) 3.3.3.5.
Initial hold (min)  10.10.1.
Final hold (min)    5.
I 1406.1397.1402.1368.
ReferenceKumazawa, Wada, et al., 2006Vichi, Castellote, et al., 2003Vichi, Castellote, et al., 2003Qian and Reineccius, 2002
Comment MSDC-RI MSDC-RI MSDC-RI MSDC-RI

Van Den Dool and Kratz RI, polar column, temperature ramp

Data compiled by: NIST Mass Spectrometry Data Center, William E. Wallace, director

Column type Capillary
Active phase FFAP
Column length (m) 30.
Carrier gas He
Substrate
Column diameter (mm) 0.25
Phase thickness (μm) 0.25
Tstart (C) 40.
Tend (C) 220.
Heat rate (K/min) 5.
Initial hold (min) 3.
Final hold (min)
I 1397.
ReferenceCalvo-Gómez, Morales-López, et al., 2004
Comment MSDC-RI

References

Kumazawa, Wada, et al., 2006
Kumazawa, K.; Wada, Y.; Masuda, H., Characterization of epoxydecenal isomers as potent odorants in black tea (Dimbula) infusion, J. Agric. Food Chem., 2006, 54, 13, 4795-4801, https://doi.org/10.1021/jf0603127 . [all data]

Vichi, Castellote, et al., 2003
Vichi, S.; Castellote, A.I.; Pizzale, L.; Conte, L.S.; Buxaderas, S.; López-Tamames, E., Analysis of virgin olive oil volatile compounds by headspace solid-phase microextraction coupled to gas chromatography with mass spectrometric and flame ionization detection, J. Chromatogr. A, 2003, 983, 1-2, 19-33, https://doi.org/10.1016/S0021-9673(02)01691-6 . [all data]

Qian and Reineccius, 2002
Qian, M.; Reineccius, G., Identification of aroma compounds in Parmigiano-Reggiano cheese by gas chromatography/olfactometry, J. Dairy Sci., 2002, 85, 6, 1362-1369, https://doi.org/10.3168/jds.S0022-0302(02)74202-1 . [all data]