2,4-Di-t-butyl chlorobenzene

Condensed phase thermochemistry data

Data compiled by: Hussein Y. Afeefy, Joel F. Liebman, and Stephen E. Stein

Quantity Value Units Method Reference Comment
Δfliquid-49.3 ± 0.4kcal/molEqkKovel, Nesterova, et al., 1982

Reaction thermochemistry data

Data compiled by: Hussein Y. Afeefy, Joel F. Liebman, and Stephen E. Stein

Individual Reactions

Benzene, chloro- + 2,4-Di-t-butyl chlorobenzene = 1-Chloro-4-(1,1-dimethylethyl)benzene + Benzene, 1-tert-butyl-2-chloro-

By formula: C6H5Cl + C14H21Cl = C10H13Cl + C10H13Cl

Quantity Value Units Method Reference Comment
Δr-0.06 ± 0.17kcal/molEqkKovzel, Nesterova, et al., 1981liquid phase

References

Kovel, Nesterova, et al., 1982
Kovel, E.N.; Nesterova, T.N.; Rozhnov, A.M., Heats of formation of tert-butylchlorobenzenes, Deposited Document, SPSTL 385 Khp-D80. Chem. Abst. 97:23198n, 1982, 1-5. [all data]

Kovzel, Nesterova, et al., 1981
Kovzel, E.N.; Nesterova, T.N.; Rozhnov, A.M.; Kartavtseva, T.A., Study of equilibrium in in the chlorobenzene-butylchlorobenzenes systems, Termodin. Organ. Soedin., 1981, 65-68. [all data]