CAS Reg. No. 80424-04-0

Reaction thermochemistry data

Data compiled by: John E. Bartmess

Individual Reactions

(CAS Reg. No. 80424-04-0 • 4294967295Monochlorine monoxide) + Monochlorine monoxide = CAS Reg. No. 80424-04-0

By formula: (CAS Reg. No. 80424-04-0 • 4294967295ClO) + ClO = CAS Reg. No. 80424-04-0

Quantity Value Units Method Reference Comment
Δr312. ± 5.9kJ/molN/ADistelrath and Boesl, 2000gas phase; Reassignment of bands from Gilles, Polak, et al., 1992
Δr334. ± 5.9kJ/molTherGilles, Polak, et al., 1992gas phase

References

Distelrath and Boesl, 2000
Distelrath, V.; Boesl, U., Mass selective gas phase study of ClO, OClO, ClOO and ClAr by anion-ZEKE-photoelectron spectroscopy, Faraday Disc. Chem. Soc., 2000, 115, 161-174, https://doi.org/10.1039/a909618c . [all data]

Gilles, Polak, et al., 1992
Gilles, M.K.; Polak, M.L.; Lineberger, W.C., Photoelectron Spectroscopy of the Halogen Oxide Anions FO-, ClO-, BrO-, IO-, OClO-, and OIO-, J. Chem. Phys., 1992, 96, 11, 8012, https://doi.org/10.1063/1.462352 . [all data]