2-Chlorododecanoic acid, chloromethyl ester

Kovats' RI, non-polar column, isothermal

View large format table.

Column type Active phase Temperature (C) I Reference Comment
CapillarySE-30140.1809.Haken, Madden, et al., 1984N2; Column length: 25. m; Column diameter: 0.22 mm
CapillarySE-30160.1840.Haken, Madden, et al., 1984N2; Column length: 25. m; Column diameter: 0.22 mm
CapillarySE-30180.1817.Haken, Madden, et al., 1984N2; Column length: 25. m; Column diameter: 0.22 mm
CapillarySE-30200.1826.Haken, Madden, et al., 1984N2; Column length: 25. m; Column diameter: 0.22 mm

Kovats' RI, polar column, isothermal

View large format table.

Column type Active phase Temperature (C) I Reference Comment
CapillaryCarbowax 20M160.2305.Haken, Madden, et al., 1984N2; Column length: 22. m; Column diameter: 0.3 mm
CapillaryCarbowax 20M180.2315.Haken, Madden, et al., 1984N2; Column length: 22. m; Column diameter: 0.3 mm
CapillaryCarbowax 20M200.2320.Haken, Madden, et al., 1984N2; Column length: 22. m; Column diameter: 0.3 mm

References

Haken, Madden, et al., 1984
Haken, J.K.; Madden, B.G.; Korhonen, I.O.O., Gas chromatography of homologous esters. XXVI. Capillary column studies of the chloromethyl esters of C5-C12 n-carboxylic acids, J. Chromatogr., 1984, 298, 150-158, https://doi.org/10.1016/S0021-9673(01)92703-7 . [all data]