Rhenium, η5-pentadienyl tricarbonyl

Gas phase ion energetics data

Data compiled by: Sharon G. Lias, John E. Bartmess, Joel F. Liebman, John L. Holmes, Rhoda D. Levin, and W. Gary Mallard

Ionization energy determinations

IE (eV) Method Reference Comment
7.8PEGreen, Paz-Sandoval, et al., 1985
8.05PEGreen, Paz-Sandoval, et al., 1985Vertical value

References

Green, Paz-Sandoval, et al., 1985
Green, J.C.; Paz-Sandoval, M.; Powell, P., He I and He II ohotoelectron spectra of open-chain pentadienyl complexes of manganese and rhenium, J. Chem. Soc. Dalton Trans., 1985, 2677. [all data]