Cyclohexanemethanol, α,α,4-trimethyl-, acetate

Kovats' RI, non-polar column, temperature ramp

View large format table.

Column type Active phase I Reference Comment
CapillaryDB-11281.Bylaite, Venskutonis, et al., 199860. m/0.25 mm/0.25 μm, He, 50. C @ 5. min, 3. K/min, 250. C @ 10. min

Normal alkane RI, non-polar column, custom temperature program

View large format table.

Column type Active phase I Reference Comment
CapillarySE-301285.Vinogradov, 2004Program: not specified
CapillarySE-301282.Vinogradov, 2004Program: not specified

Normal alkane RI, polar column, temperature ramp

View large format table.

Column type Active phase I Reference Comment
CapillaryTC-Wax1557.Shuichi, Masazumi, et al., 199680. C @ 5. min, 3. K/min; Column length: 60. m; Column diameter: 0.25 mm; Tend: 240. C

Normal alkane RI, polar column, custom temperature program

View large format table.

Column type Active phase I Reference Comment
CapillaryCarbowax 20M1594.Vinogradov, 2004Program: not specified
CapillaryCarbowax 20M1561.Vinogradov, 2004Program: not specified

References

Bylaite, Venskutonis, et al., 1998
Bylaite, E.; Venskutonis, R.P.; Roozen, J.P., Influence of harvesting time on the composition of volatile components in different anatomical parts of lovage (Levisticum officinale Koch.), J. Agric. Food Chem., 1998, 46, 9, 3735-3740, https://doi.org/10.1021/jf9800559 . [all data]

Vinogradov, 2004
Vinogradov, B.A., Production, composition, properties and application of essential oils, 2004, retrieved from http://viness.narod.ru. [all data]

Shuichi, Masazumi, et al., 1996
Shuichi, H.; Masazumi, N.; Hiromu, K.; Kiyoshi, F., Comparison of volatile compounds berween the crude drugs, Onji-tsutsu and Onji-niki, Nippon nogei kagaku kaishi, 1996, 70, 2, 151-160. [all data]