Carvoxime(L)

Condensed phase thermochemistry data

Data compiled by: Eugene S. Domalski and Elizabeth D. Hearing

Constant pressure heat capacity of solid

Cp,solid (cal/mol*K) Temperature (K) Reference Comment
61.11298.15Meijer, Blok, et al., 1977T = 160 to 385 K.

Phase change data

Data compiled as indicated in comments:
AC - William E. Acree, Jr., James S. Chickos
DH - Eugene S. Domalski and Elizabeth D. Hearing

Enthalpy of sublimation

ΔsubH (kcal/mol) Temperature (K) Method Reference Comment
21.7 ± 1.1334.HASChickos, Garin, et al., 1981Based on data from 324. - 343. K.; AC

Enthalpy of fusion

ΔfusH (kcal/mol) Temperature (K) Method Reference Comment
5.4254346.5N/AMeijer, Blok, et al., 1977DH
5.430346.5DTAChickos, Garin, et al., 1981AC

Entropy of fusion

ΔfusS (cal/mol*K) Temperature (K) Reference Comment
15.7346.5Meijer, Blok, et al., 1977DH

References

Meijer, Blok, et al., 1977
Meijer, E.L.; Blok, J.G.; Kroon, J.; Oonk, H.A.J., The carvoxime system. IV. Heat capacities and enthalpies of melting of DL-carvoxime, L-carvoxime and standard n-heptane, Thermochim. Acta, 1977, 20, 325-334. [all data]

Chickos, Garin, et al., 1981
Chickos, J.S.; Garin, D.L.; Hitt, M.; Schilling, G., Some solid state properties of enantiomers and their racemates, Tetrahedron, 1981, 37, 12, 2255-2259, https://doi.org/10.1016/S0040-4020(01)97981-5 . [all data]