C17H13Cl

Reaction thermochemistry data

Data compiled by: John E. Bartmess

Individual Reactions

C17H12Cl- + Hydrogen cation = C17H13Cl

By formula: C17H12Cl- + H+ = C17H13Cl

Quantity Value Units Method Reference Comment
Δr336.2 ± 2.1kcal/molG+TSTaft, 1987gas phase; value altered from reference due to change in acidity scale
Quantity Value Units Method Reference Comment
Δr328.8 ± 2.0kcal/molIMRETaft, 1987gas phase; value altered from reference due to change in acidity scale

References

Taft, 1987
Taft, R.W., The Nature and Analysis of Substitutent Electronic Effects, Personal communication. See also Prog. Phys. Org. Chem., 1987, 16, 1. [all data]