(Z)-whiskey lactone

Normal alkane RI, polar column, temperature ramp

Data compiled by: NIST Mass Spectrometry Data Center, William E. Wallace, director

Column type CapillaryCapillary
Active phase DB-Wax EtrDB-Wax
Column length (m) 60.30.
Carrier gas HeH2
Substrate
Column diameter (mm) 0.250.32
Phase thickness (μm) 0.250.5
Tstart (C) 40.40.
Tend (C) 230.200.
Heat rate (K/min) 2.4.
Initial hold (min) 5.5.
Final hold (min) 100.
I 1976.1985.
ReferenceIbarz, Ferreira, et al., 2006Culleré, Escudero, et al., 2004
Comment MSDC-RI MSDC-RI

References

Ibarz, Ferreira, et al., 2006
Ibarz, M.J.; Ferreira, V.; Hernández-Orte, P.; Loscos, N.; Cacho, J., Optimization and evaluation of a procedure for the gas chromatographic-mass spectrometric analysis of the aromas generated by fast acid hydrolysis of flavor precursors extracted from grapes, J. Chromatogr. A, 2006, 1116, 1-2, 217-229, https://doi.org/10.1016/j.chroma.2006.03.020 . [all data]

Culleré, Escudero, et al., 2004
Culleré, L.; Escudero, A.; Cacho, J.; Ferreira, V., Gas chromatography-olfactometry and chemical quantitative study of the aroma of six premium auality Spanish aged red wines, J. Agric. Food Chem., 2004, 52, 6, 1653-1660, https://doi.org/10.1021/jf0350820 . [all data]