Selenium bromide cyanide

Gas phase ion energetics data

Data compiled by: Sharon G. Lias, Rhoda D. Levin, and Sherif A. Kafafi

Ionization energy determinations

IE (eV) Method Reference Comment
9.99 ± 0.02PEJonkers, Mooyman, et al., 1981Vertical value

References

Jonkers, Mooyman, et al., 1981
Jonkers, G.; Mooyman, R.; De Lange, C.A., Ultraviolet photoelectron spectroscopy of unstable species: Nitrosyl cyanide (ONCN), Chem. Phys., 1981, 57, 97. [all data]