(E)-5,5-Dimethyl-3-hexen-1-yne

Reaction thermochemistry data

Data compiled by: Hussein Y. Afeefy, Joel F. Liebman, and Stephen E. Stein

Individual Reactions

(E)-5,5-Dimethyl-3-hexen-1-yne = 3-Hexen-1-yne, 5,5-dimethyl-, (Z)-

By formula: C8H12 = C8H12

Quantity Value Units Method Reference Comment
Δr0.4 ± 5.9kJ/molEqkRoth, Hopf, et al., 1994gas phase; At 1008 K

References

Roth, Hopf, et al., 1994
Roth, W.R.; Hopf, H.; Horn, C., Propargyl-Stabilisierungsenergie, Chem. Ber., 1994, 127, 1781-1795. [all data]