HSiCl3+

Vibrational and/or electronic energy levels

Data compiled by: Marilyn E. Jacox

State:   F

 Energy
 (cm-1
 Med.   Transition   λmin
 (nm)
 λmax
 (nm)

References

Txx = 50020 ± 320 gas Frost, Herring, et al., 1971

Vib.
sym.
 No.   Approximate
 type of mode
 cm-1   Med.   Method   References

a1 1 SiH stretch 2000 T gas PE Frost, Herring, et al., 1971

State:   E

 Energy
 (cm-1
 Med.   Transition   λmin
 (nm)
 λmax
 (nm)

Txx = 24530 ± 320 gas Frost, Herring, et al., 1971

State:   D

 Energy
 (cm-1
 Med.   Transition   λmin
 (nm)
 λmax
 (nm)

Txx = 22670 ± 320 gas Frost, Herring, et al., 1971

State:   C

 Energy
 (cm-1
 Med.   Transition   λmin
 (nm)
 λmax
 (nm)

Txx = 9120 ± 320 gas Frost, Herring, et al., 1971

State:   A,B

 Energy
 (cm-1
 Med.   Transition   λmin
 (nm)
 λmax
 (nm)

Txx = 3790 ± 320 gas Frost, Herring, et al., 1971

Additional references: Jacox, 1994, page 276

Frost, Herring, et al., 1971
Frost, D.C.; Herring, F.G.; Katrib, A.; McLean, R.A.N.; Drake, J.E.; Westwood, N.P.C., Photoelectron spectra and bonding in some halosilanes, Can. J. Chem., 1971, 49, 4033. [all data]

Jacox, 1994
Jacox, M.E., Vibrational and electronic energy levels of polyatomic transient molecules, American Chemical Society, Washington, DC, 1994, 464. [all data]