Potassium dicopper trichloride

Gas phase ion energetics data

Data compiled by: Sharon G. Lias, Rhoda D. Levin, and Sherif A. Kafafi

Ionization energy determinations

IE (eV) Method Reference
10.7EIBloom and Williams, 1981

References

Bloom and Williams, 1981
Bloom, H.; Williams, D.J., A mass spectrometric study of the vapors above the molten salt systems LiCl-CuCl, LiBr-CuBr, and NaI-CuI, J. Chem. Phys., 1981, 75, 4636. [all data]