3-Buten-2-one, 4-(2,2,3-trimethyl-6-methylenecyclohexyl)-

Normal alkane RI, non-polar column, temperature ramp

Data compiled by: NIST Mass Spectrometry Data Center, William E. Wallace, director

Column type Capillary
Active phase SPB-5
Column length (m) 60.
Carrier gas
Substrate
Column diameter (mm) 0.32
Phase thickness (μm) 1.
Tstart (C) 40.
Tend (C) 230.
Heat rate (K/min) 3.
Initial hold (min) 5.
Final hold (min) 5.
I 1502.
ReferenceVasta, Ratel, et al., 2007
Comment MSDC-RI

References

Vasta, Ratel, et al., 2007
Vasta, V.; Ratel, J.; Engel, E., Mass Spectrometry Analysis of Volatile Compounds in Raw Meat for the Authentication of the Feeding Background of Farm Animals, J. Agric. Food Chem., 2007, 55, 12, 4630-4639, https://doi.org/10.1021/jf063432n . [all data]