9,10[1',2']-Benzenoanthracene, 9,10-dibromo-9,10-dihydro-

Gas phase ion energetics data

Data compiled as indicated in comments:
LBLHLM - Sharon G. Lias, John E. Bartmess, Joel F. Liebman, John L. Holmes, Rhoda D. Levin, and W. Gary Mallard

Ionization energy determinations

IE (eV) Method Reference Comment
8.1PEMartin, Mayer, et al., 1983LBLHLM
8.2PEMartin, Mayer, et al., 1983Vertical value; LBLHLM

References

Martin, Mayer, et al., 1983
Martin, H.-D.; Mayer, B.; Gleiter, R.; Schafer, W.; Vogtle, F., Photoelektronenspektroskopische untersuchung transanularer π-,σ- und n-wechselwirkungen in bruckenkopfsubstituierten triptycenen, Chem. Ber., 1983, 116, 2546. [all data]