Hexa-2,4-dienylbenzene

Normal alkane RI, non-polar column, temperature ramp

Data compiled by: NIST Mass Spectrometry Data Center, William E. Wallace, director

Column type CapillaryCapillaryCapillaryCapillary
Active phase HP-5MSCP Sil 8 CBDB-1DB-1
Column length (m) 30.30.30.50.
Carrier gas HeHeN2He
Substrate
Column diameter (mm) 0.250.250.250.25
Phase thickness (μm) 0.250.250.250.25
Tstart (C) 60.50.80.70.
Tend (C) 220.220.225.240.
Heat rate (K/min) 6.3.4.4.
Initial hold (min) 3.2.
Final hold (min)
I 1517.1500.1446.1446.
ReferenceSafaei-Ghomi, Bamoniri, et al., 2005Juteau, Masotti, et al., 2002Palá-Paúl, Pérez-Alonso, et al., 2001Palá-Paúl, Pérez-Alonso, et al., 1999
Comment MSDC-RI MSDC-RI MSDC-RI MSDC-RI

References

Safaei-Ghomi, Bamoniri, et al., 2005
Safaei-Ghomi, J.; Bamoniri, A.; Sarafraz, M.B.; Batooli, H., Volatile components from Artemisia scoparia Waldst et Kit growing in central Iran, Flavour Fragr. J., 2005, 20, 6, 650-652, https://doi.org/10.1002/ffj.1520 . [all data]

Juteau, Masotti, et al., 2002
Juteau, F.; Masotti, V.; Bessière, J.-M., Compositional characteristics of the essential oil of Artemisia campestris var. glutinosa, Biochem. Syst. Ecol., 2002, 30, 11, 1065-1070, https://doi.org/10.1016/S0305-1978(02)00052-2 . [all data]

Palá-Paúl, Pérez-Alonso, et al., 2001
Palá-Paúl, J.; Pérez-Alonso, M.J.; Velasco-Negueruela, A.; Palá-Paúl, R.; Sanz, J.; Conejero, Fco., Seasonal variation in chemical constituents of Santolina rosmarinifolia L. ssp. rosmarinifolia, Biochem. Syst. Ecol., 2001, 29, 7, 663-672, https://doi.org/10.1016/S0305-1978(01)00032-1 . [all data]

Palá-Paúl, Pérez-Alonso, et al., 1999
Palá-Paúl, J.; Pérez-Alonso, M.J.; Velasco-Negueruela, A.; Ramos-Vázquez, P.; Gómez-Contreras, F.; Sanz, J., Essential oil of Santolina rosmarinifolia L. ssp. rosmarinifolia: first isolation of capillene, a diacetylene derivative, Flavour Fragr. J., 1999, 14, 2, 131-134, https://doi.org/10.1002/(SICI)1099-1026(199903/04)14:2<131::AID-FFJ794>3.0.CO;2-7 . [all data]