CAS Reg. No. 79431-04-2

Reaction thermochemistry data

Data compiled by: John E. Bartmess

Individual Reactions

(CAS Reg. No. 79431-04-2 • 4294967295Benzene) + Benzene = CAS Reg. No. 79431-04-2

By formula: (CAS Reg. No. 79431-04-2 • 4294967295C6H6) + C6H6 = CAS Reg. No. 79431-04-2

Quantity Value Units Method Reference Comment
Δr21.5 ± 4.2kcal/molTherLee and Squires, 1986gas phase; Between SiH4, tBuOH; value altered from reference due to change in acidity scale

References

Lee and Squires, 1986
Lee, R.E.; Squires, R.R., Anionic homoaromaticity: A gas phase experimental study, J. Am. Chem. Soc., 1986, 105, 5078. [all data]